Id,ExtractRunId,PartNumber,BasePartNumber,CorePartNumber,ProductLine,SequenceNumber,SubProductLine,ImagePath,WebDescription1,WebDescription2,WebDescription3,FrenchDescription1,FrenchDescription2,DefaultUnitOfMeasure,SecurityCode,SoldOnWeb,PlatinumPlus,Capa,KeyTrac,C2COnWeb,OverSize,ValueLine,NSF,Weight,ListPrice,CustomerPrice,QuantityAvailable,DateCreated,Length,Width,Depth,HighRisk,Reman
1543973308,263313,ABPCV31ELS,,,665,6020,,http://mediacdn.lkqcorp.com/ecomm/665/ABPCV31ELS.jpg?width=400,MIRROR DRIVER SIDE POWER HEAT WITH SIGNAL WITH PUDDLE LIGHT MANUAL,FOLDING,MIRROR LH;PWR;HTD;03-06 TAHOEW/SIGNAL/PDL LMP;MANUAL FOLD,MIROIR GA ELECTRI HEAT,W/SIGNAL/PUDDLE LAMP MAN FOLD,EA,,True,False,False,False,False,False,False,False,5.0000,361.00,152.06,19,4/20/2024 3:01:00 AM,15,10,6,False,False
1544077031,263313,ABPCV31ERS,,,665,6020,,http://mediacdn.lkqcorp.com/ecomm/665/ABPCV31ERS.jpg?width=400,MIRROR PASSENGER SIDE POWER HEAT WITH SIGNAL WITH PUDDLE LIGHT,MANUAL FOLDING,MIRROR RH;PWR;HTD;03-06 TAHOEW/SIGNAL/PDL LMP;MANUAL FOLD,MIROIR DR ELECTRI HEAT,W/SIGNAL/PUDDLE LAMP MAN FOLD,EA,,True,False,False,False,False,False,False,False,5.0000,379.00,157.63,8,4/20/2024 3:01:00 AM,15,10,6,False,False
1543942572,263313,AC1000130,,,773,1000,,http://mediacdn.lkqcorp.com/ecomm/773/AC1000130.jpg?width=400,FRONT BUMPER COVER,,BMP COV FT;ALL;98-01 INTEGRA,P-CHOC AV,,EA,,True,False,False,False,False,False,False,False,18.0000,391.80,148.10,0,4/20/2024 3:01:00 AM,73,27,16,True,False
1544088703,263313,AC1000140,,,773,1000,,http://mediacdn.lkqcorp.com/ecomm/773/AC1000140.jpg?width=400,FRONT BUMPER COVER; PRIMED/PAINT TO MATCH; MADE OF PLASTIC,,BMP COV FT;01-03 MDXPRIME;PLASTIC,COUVERT P-CHOCS AV,A/APPRET PLSTQ,EA,,True,False,False,False,False,False,False,False,15.0000,452.07,157.28,1,4/20/2024 3:01:00 AM,68,25,19,True,False
1544083320,263313,AC1000141,,,773,1000,,http://mediacdn.lkqcorp.com/ecomm/773/AC1000141.jpg?width=400,FRONT BUMPER COVER,,BMP COV FT;02-03 3.2 TL,P-CHOC AV 3.2TL,,EA,,True,False,False,False,False,False,False,False,15.0000,391.35,144.35,1,4/20/2024 3:01:00 AM,74,26,19,True,False
1544086325,263313,AC1000141PP,,,773,1000,,http://mediacdn.lkqcorp.com/ecomm/773/AC1000141PP.jpg?width=400,FRONT BUMPER COVER,,BMP COV FT;02-03 3.2 TL,P-CHOC AV 3.2TL,,EA,,True,True,True,True,False,False,False,False,15.0000,398.69,160.26,10,4/20/2024 3:01:00 AM,74,26,19,True,False
1543911168,263313,AC1000143,,,773,1000,,http://mediacdn.lkqcorp.com/ecomm/773/AC1000143.jpg?width=400,FRONT BUMPER COVER,,BMP COV FT;02-04 RSX,P-CHOC AV,,EA,,True,False,False,False,False,False,False,False,12.0000,422.44,173.25,0,4/20/2024 3:01:00 AM,69,25,16,True,False
1543900108,263313,AC1000145,,,773,1000,,http://mediacdn.lkqcorp.com/ecomm/773/AC1000145.jpg?width=400,FRONT BUMPER COVER,,BMP COV FT;04-05 TSX,P-CHOC AV,,EA,,True,False,False,False,False,False,False,False,12.0000,422.44,163.08,2,4/20/2024 3:01:00 AM,73,27,16,True,False
1543999475,263313,AC1000149,,,773,1000,,http://mediacdn.lkqcorp.com/ecomm/773/AC1000149.jpg?width=400,FRONT BUMPER COVER; WITHOUT ACURA LOGO; PRIMED/PAINT TO MATCH FINISH,,BMP COV FT;04-06 TLWO/ACURA LOGO,P-CHOC AV,S/ACURA LOGO,EA,,True,False,False,False,False,False,False,False,12.0000,392.56,151.25,0,4/20/2024 3:01:00 AM,71,32,19,True,False
1543981125,263313,AC1000150,,,773,1000,,http://mediacdn.lkqcorp.com/ecomm/773/AC1000150.jpg?width=400,FRONT BUMPER COVER; PRIMED/PAINT TO MATCH; MADE OF PLASTIC,,BMP COV FT;04-06 MDXPRIME;PLASTIC,COUVERT P-CHOCS AV,A/APPRET PLSTQ,EA,,True,False,False,False,False,False,False,False,14.0000,436.86,82.66,1,4/20/2024 3:01:00 AM,79,28,21,True,False
1543887216,263313,AC1000150PP,,,773,1000,,http://mediacdn.lkqcorp.com/ecomm/773/AC1000150PP.jpg?width=400,FRONT BUMPER COVER; PRIMED/PAINT TO MATCH; MADE OF PLASTIC,,BMP COV FT;04-06 MDXPRIME;PLASTIC,COUVERT P-CHOCS AV,A/APPRET PLSTQ,EA,,True,True,True,True,False,False,False,False,14.0000,446.62,82.54,5,4/20/2024 3:01:00 AM,79,28,21,True,False
1544073693,263313,AC1000154,,,773,1000,,http://mediacdn.lkqcorp.com/ecomm/773/AC1000154.jpg?width=400,FRONT BUMPER COVER; PRIMED/PAINT TO MATCH,,BMP COV FT;05-06 RSXPRIME/PAINT TO MATCH,COUVERT P-CHOCS AV,PRIME/PAINT TO MATCH,EA,,True,False,False,False,False,False,False,False,12.0000,422.44,171.77,0,4/20/2024 3:01:00 AM,73,27,16,True,False
1544151033,263313,AC1000156,,,773,1000,,http://mediacdn.lkqcorp.com/ecomm/773/AC1000156.jpg?width=400,FRONT BUMPER COVER; PRIMED/PAINT TO MATCH; MADE OF PLASTIC,,BMP COV FT;06-08 TSXPRIME;PLASTIC,COUVERT P-CHOCS AV,A/APPRET PLSTQ,EA,,True,False,False,False,False,False,False,False,12.0000,417.02,210.89,4,4/20/2024 3:01:00 AM,75,30,25,True,False
1543939152,263313,AC1000156C,,,773,1000,,http://mediacdn.lkqcorp.com/ecomm/773/AC1000156C.jpg?width=400,FRONT BUMPER COVER; PRIMED/PAINT TO MATCH; MADE OF PLASTIC,,BMP COV FT;06-08 TSXPRIME;PLASTIC,COUVERT P-CHOCS AV,A/APPRET PLSTQ,EA,,True,False,True,True,False,False,False,False,12.0000,422.44,188.85,5,4/20/2024 3:01:00 AM,75,30,25,True,False
1544081549,263313,AC1000157,,,773,1000,,http://mediacdn.lkqcorp.com/ecomm/773/AC1000157.jpg?width=400,FRONT BUMPER COVER; WITHOUT HEAD LIGHT WASHER HOLES; PRIMED/PAINT TO,MATCH; MADE OF PLASTIC,BMP COV FT;WO/WASHERS;7-09 MDXPRIME;PLASTIC,COUVERT P-CHOCS AV S/LAVE-PHAR,A/APPRET PLSTQ,EA,,True,False,False,False,False,False,False,False,12.0000,553.30,62.27,0,4/20/2024 3:01:00 AM,77,26,19,True,False
1543948937,263313,AC1000157PP,,,773,1000,,http://mediacdn.lkqcorp.com/ecomm/773/AC1000157PP.jpg?width=400,FRONT BUMPER COVER; WITHOUT HEAD LIGHT WASHER HOLES; PRIMED/PAINT TO,MATCH; MADE OF PLASTIC,BMP COV FT;WO/WASHERS;7-09 MDXPRIME;PLASTIC,COUVERT P-CHOCS AV S/LAVE-PHAR,A/APPRET PLSTQ,EA,,True,True,True,True,False,False,False,False,12.0000,567.76,95.11,0,4/20/2024 3:01:00 AM,77,26,19,True,False
1543978493,263313,AC1000158,,,773,1000,,http://mediacdn.lkqcorp.com/ecomm/773/AC1000158.jpg?width=400,FRONT UPPER BUMPER COVER; PRIMED/PAINT TO MATCH; MADE OF PLASTIC,,BMP COV FT UP;07-09 RDXPRIME;PLASTIC,COUVERT P-CHOCS AV HAUT,A/APPRET PLSTQ,EA,,True,False,False,False,False,False,False,False,6.0000,329.46,134.34,1,4/20/2024 3:01:00 AM,78,28,16,True,False
1543895979,263313,AC1000158C,,,773,1000,,http://mediacdn.lkqcorp.com/ecomm/773/AC1000158C.jpg?width=400,FRONT UPPER BUMPER COVER; PRIMED/PAINT TO MATCH; MADE OF PLASTIC,,BMP COV FT UP;07-09 RDXPRIME;PLASTIC,COUVERT P-CHOCS AV HAUT,A/APPRET PLSTQ,EA,,True,False,True,True,False,False,False,False,6.0000,336.45,161.56,1,4/20/2024 3:01:00 AM,78,28,16,True,False
1543968110,263313,AC1000159,,,773,1000,,http://mediacdn.lkqcorp.com/ecomm/773/AC1000159.jpg?width=400,FRONT LOWER BUMPER COVER; FACTORY INSTALLED STYLE; PRIMED/PAINT TO,MATCH FINISH,BMP COV FT LW;07-09 RDXFACTORY INSTALLED TYPE;PRIME,COUVERT P-CHOCS AV BAS,FACTORY INSTALLED TYPE PRIME,EA,,True,False,False,False,False,False,False,False,12.0000,323.82,135.14,0,4/20/2024 3:01:00 AM,71,23,11,True,False
1543929164,263313,AC1000159C,,,773,1000,,http://mediacdn.lkqcorp.com/ecomm/773/AC1000159C.jpg?width=400,FRONT LOWER BUMPER COVER; FACTORY INSTALLED TYPE; PRIMED/PAINT TO,MATCH FINISH,BMP COV FT LW;07-09 RDXFACTORY INSTALLED TYPE;PRIME,COUVERT P-CHOCS AV BAS,FACTORY INSTALLED TYPE A/APPRET,EA,,True,False,True,True,False,False,False,False,12.0000,330.23,156.07,0,4/20/2024 3:01:00 AM,71,23,11,True,False
1543987264,263313,AC1000160,,,773,1000,,http://mediacdn.lkqcorp.com/ecomm/773/AC1000160.jpg?width=400,BUMPER COVER; FRONT; BASE/NAVI MODELS,,BMP COV FT;BASE/NAVI;07-08 TLPNT;TOP EDGE OF FOG POINTS OUT,P-CHOC AV BASE,NAVI PRIME,EA,,True,False,False,False,False,False,False,False,12.0000,394.59,168.69,0,4/20/2024 3:01:00 AM,73,30,16,True,False
1543995499,263313,AC1000162,,,773,1000,,http://mediacdn.lkqcorp.com/ecomm/773/AC1000162.jpg?width=400,FRONT BUMPER COVER; GRAY PRIMER FINISH; MADE OF PLASTIC,,BMP COV FT;09-10 TSXGRAY PRIMER;PLASTIC,COUVERT P-CHOCS AV,A/APPRET GRIS PLSTQ,EA,,True,False,False,False,False,False,False,False,16.0000,417.02,148.87,6,4/20/2024 3:01:00 AM,72,28,21,True,False
1544131766,263313,AC1000162PP,,,773,1000,,http://mediacdn.lkqcorp.com/ecomm/773/AC1000162PP.jpg?width=400,FRONT BUMPER COVER; BLACK PRIMER FINISH; MADE OF PLASTIC,,BMP COV FT;09-10 TSXBLACK PRIMER;PLASTIC,COUVERT P-CHOCS AV,A/APPRET NOIR PLSTQ,EA,,True,True,True,True,False,False,False,False,16.0000,422.44,167.97,7,4/20/2024 3:01:00 AM,72,28,21,True,False
1543953302,263313,AC1000163,,,773,1000,,http://mediacdn.lkqcorp.com/ecomm/773/AC1000163.jpg?width=400,FRONT BUMPER COVER; WIHTOUT HEAD LIGHT WASHER HOLES; PRIMED/PAINT TO,MATCH; MADE OF PLASTIC,BMP COV FT;WO/WASHERS;09-11 TLPRIME;PLASTIC,COUVERT P-CHOCS AV S/LAVE-PHAR,A/APPRET PLSTQ,EA,,True,False,False,False,False,False,False,False,10.0000,390.14,53.27,1,4/20/2024 3:01:00 AM,73,28,22,True,False
1543923681,263313,AC1000163PP,,,773,1000,,http://mediacdn.lkqcorp.com/ecomm/773/AC1000163PP.jpg?width=400,FRONT BUMPER COVER; WITHOUT HEAD LIGHT WASHER HOLES; PRIMED/PAINT TO,MATCH; MADE OF PLASTIC,BMP COV FT;WO/WASHERS;09-11 TLPRIME;PLASTIC,COUVERT P-CHOCS AV S/LAVE-PHAR,A/APPRET PLSTQ,EA,,True,True,True,True,False,False,False,False,10.0000,405.71,61.02,2,4/20/2024 3:01:00 AM,73,28,22,True,False
1544075518,263313,AC1000168,,,773,1000,,http://mediacdn.lkqcorp.com/ecomm/773/AC1000168.jpg?width=400,FRONT BUMPER COVER; PRIMED/PAINT TO MATCH; MADE OF PLASTIC,,BMP COV FT;10-12 RDXPRIME;PLASTIC,COUVERT P-CHOCS AV,A/APPRET PLSTQ,EA,,True,False,False,False,False,False,False,False,12.0000,422.67,198.19,0,4/20/2024 3:01:00 AM,76,31,26,True,False
1544084014,263313,AC1000168C,,,773,1000,,http://mediacdn.lkqcorp.com/ecomm/773/AC1000168C.jpg?width=400,FRONT BUMPER COVER; PRIMED/PAINT TO MATCH; MADE OF PLASTIC,,BMP COV FT;10-12 RDXPRIME;PLASTIC,COUVERT P-CHOCS AV,A/APPRET PLSTQ,EA,,True,False,True,True,False,False,False,False,12.0000,438.74,211.98,2,4/20/2024 3:01:00 AM,76,31,26,True,False
1544075983,263313,AC1000171R,,,773R,1000,,http://mediacdn.lkqcorp.com/ecomm/773R/AC1000171R.jpg?width=400,RECONDITIONED FRONT BUMPER COVER; WITHOUT HEAD LIGHT WASHER HOLES;,PRIMED/PAINT TO MATCH WITH TEXTURED LOWER; MADE OF PLASTIC,BMP COV FT;WO/WASHERS;10-2 ZDXPRIME W/TEXT LWR;PLASTIC,COUVERT P-CHOCS AV S/LAVE-PHAR,A/APPRET A/TEXT BAS PLSTQ,EA,,True,True,False,False,False,False,False,False,15.0000,661.28,248.51,2,4/20/2024 3:01:00 AM,73,27,16,True,True
1544075577,263313,AC1000172,,,773,1000,,http://mediacdn.lkqcorp.com/ecomm/773/AC1000172.jpg?width=400,FRONT BUMPER COVER; WITHOUT HEAD LIGHT WASHER HOLES; PRIMED/PAINT TO,MATCH WITH TEXTURED LOWER EDGE EACH END; MADE OF PLASTIC,BMP COV FT;WO/WASHERS;10-3 MDXPRIME W/TEXT LWR EDGE;PLASTIC,COUVERT P-CHOCS AV S/LAVE-PHAR,A/APPRET-TEXT BAS PLSTQ,EA,,True,False,False,False,False,False,False,False,11.0000,348.99,98.31,0,4/20/2024 3:01:00 AM,85,21,20,True,False
1543904625,263313,AC1000172C,,,773,1000,,http://mediacdn.lkqcorp.com/ecomm/773/AC1000172C.jpg?width=400,FRONT BUMPER COVER; WITHOUT HEAD LIGHT WASHER HOLES; PRIMED/PAINT TO,MATCH WITH TEXTURED LOWER EDGE EACH END; MADE OF PLASTIC,BMP COV FT;WO/WASHERS;10-3 MDXPRIME W/TEXT LWR EDGE;PLASTIC,COUVERT P-CHOCS AV S/LAVE-PHAR,A/APPRET-TEXT BAS PLSTQ,EA,,True,False,True,True,False,False,False,False,11.0000,356.50,111.98,0,4/20/2024 3:01:00 AM,85,21,20,True,False
1543975333,263313,AC1000172R,,,773R,1000,,http://mediacdn.lkqcorp.com/ecomm/773R/AC1000172R.jpg?width=400,RECONDITIONED FRONT BUMPER COVER; WITHOUT HEAD LIGHT WASHER HOLES;,PRIMED/PAINT TO MATCH WITH TEXTURED LOWER EDGE EACH END; MADE OF,BMP COV FT;WO/WASHERS;10-3 MDXPRIME W/TEXT LWR EDGE;PLASTIC,COUVERT P-CHOCS AV S/LAVE-PHAR,A/APPRET-TEXT BAS PLSTQ,EA,,True,True,False,False,False,False,False,False,11.0000,356.79,209.02,1,4/20/2024 3:01:00 AM,85,21,20,True,True
1543979489,263313,AC1000177,,,773,1000,,http://mediacdn.lkqcorp.com/ecomm/773/AC1000177.jpg?width=400,FRONT BUMPER COVER; FOR SEDAN AND SPORT WAGON MODEL; PRIMED/PAINT TO,MATCH; MADE OF PLASTIC,BMP COV FT;11-14 TSX SDN/SWPRIME;PLASTIC,COUVERT P-CHOCS AV SDN/FAMILIE,A/APPRET PLSTQ,EA,,True,False,False,False,False,False,False,False,13.0000,645.09,129.39,3,4/20/2024 3:01:00 AM,74,23,20,True,False
1544088204,263313,AC1000177C,,,773,1000,,http://mediacdn.lkqcorp.com/ecomm/773/AC1000177C.jpg?width=400,FRONT BUMPER COVER; FOR SEDAN AND SPORT WAGON MODEL; PRIMED/PAINT,TO MATCH; MADE OF PLASTIC,BMP COV FT;11-14 TSX SDN/SWPRIME;PLASTIC,COUVERT P-CHOCS AV SDN/FAMILIE,A/APPRET PLSTQ,EA,,True,False,True,True,False,False,False,False,12.7000,657.67,174.28,0,4/20/2024 3:01:00 AM,74,23,20,True,False
1543924530,263313,AC1000178,,,773,1000,,http://mediacdn.lkqcorp.com/ecomm/773/AC1000178.jpg?width=400,FRONT BUMPER COVER; WITHOUT HEAD LIGHT WASHER HOLES; PRIMED/PAINT TO,MATCH; MADE OF PLASTIC,BMP COV FT;WO/WASHERS;12-14 TLPRIME;PLASTIC,COUVERT P-CHOCS AV S/LAVE-PHAR,A/APPRET PLSTQ,EA,,True,False,False,False,False,False,False,False,12.0000,391.07,81.31,0,4/20/2024 3:01:00 AM,83,27,22,True,False
1543940842,263313,AC1000178C,,,773,1000,,http://mediacdn.lkqcorp.com/ecomm/773/AC1000178C.jpg?width=400,FRONT BUMPER COVER; PRIMED/PAINT TO MATCH FINISH,,BMP COV FT;WO/WASHERS;12-14 TLPRIME;PLASTIC,COUVERT P-CHOCS AV S/LAVE-PHAR,A/APPRET PLSTQ,EA,,True,False,True,True,False,False,False,False,12.0000,399.14,77.17,0,4/20/2024 3:01:00 AM,83,27,22,True,False
1543998998,263313,AC1000178OE,,,773,1000,,http://mediacdn.lkqcorp.com/ecomm/773/AC1000178OE.jpg?width=400,FRONT BUMPER COVER; WITHOUT HEAD LIGHT WASHER HOLES; PRIMED/PAINT TO,MATCH; MADE OF PLASTIC,BMP COV FT;WO/WASHERS;12-14 TLPRIME;PLASTIC,COUVERT P-CHOCS AV S/LAVE-PHAR,A/APPRET PLSTQ,EA,,True,False,False,False,False,False,False,False,12.0000,402.32,329.73,0,4/20/2024 3:01:00 AM,83,27,22,True,False
1543926374,263313,AC1000179,,,773,1000,,http://mediacdn.lkqcorp.com/ecomm/773/AC1000179.jpg?width=400,FRONT BUMPER COVER; PRIMED/PAINT TO MATCH; MADE OF PLASTIC,,BMP COV FT;13-15 RDXPRIME;PLASTIC,COUVERT P-CHOCS AV,A/APPRET PLSTQ,EA,,True,False,False,False,False,False,False,False,10.3000,397.14,108.41,0,4/20/2024 3:01:00 AM,72,30,25,True,False
1544079212,263313,AC1000179PP,,,773,1000,,http://mediacdn.lkqcorp.com/ecomm/773/AC1000179PP.jpg?width=400,FRONT BUMPER COVER; PRIMED/PAINT TO MATCH; MADE OF PLASTIC,,BMP COV FT;13-15 RDXPRIME;PLASTIC,COUVERT P-CHOCS AV,A/APPRET PLSTQ,EA,,True,True,True,True,False,False,False,False,10.0000,402.65,114.67,15,4/20/2024 3:01:00 AM,72,30,25,True,False
1543970084,263313,AC1000180,,,773,1000,,http://mediacdn.lkqcorp.com/ecomm/773/AC1000180.jpg?width=400,FRONT BUMPER COVER; PRIMED/PAINT TO MATCH; MADE OF PLASTIC,,BMP COV FT;13-15 ILX/HYBRIDPRIME;PLASTIC,COUVERT P-CHOCS AV,A/APPRET PLSTQ,EA,,True,False,False,False,False,False,False,False,8.0000,421.27,120.34,0,4/20/2024 3:01:00 AM,70,27,22,True,False
1543944727,263313,AC1000180C,,,773,1000,,http://mediacdn.lkqcorp.com/ecomm/773/AC1000180C.jpg?width=400,FRONT BUMPER COVER; PRIMED/PAINT TO MATCH; MADE OF PLASTIC,,BMP COV FT;13-15 ILX/HYBRIDPRIME;PLASTIC,COUVERT P-CHOCS AV,A/APPRET PLSTQ,EA,,True,False,True,True,False,False,False,False,8.0000,426.65,131.40,10,4/20/2024 3:01:00 AM,70,27,22,True,False
1543992830,263313,AC1000180OE,,,773,1000,,http://mediacdn.lkqcorp.com/ecomm/773/AC1000180OE.jpg?width=400,FRONT BUMPER COVER; PRIMED/PAINT TO MATCH; MADE OF PLASTIC,,BMP COV FT;13-15 ILX/HYBRIDPRIME;PLASTIC,COUVERT P-CHOCS AV,A/APPRET PLSTQ,EA,,True,False,False,False,False,False,False,False,8.0000,428.62,351.01,1,4/20/2024 3:01:00 AM,70,27,22,True,False
1543989677,263313,AC1000183,,,773,1000,,http://mediacdn.lkqcorp.com/ecomm/773/AC1000183.jpg?width=400,FRONT BUMPER COVER; WITHOUT HEAD LIGHT WASHER HOLES; WITHOUT PARK,ASSIST SENSOR HOLES; PRIMED/PAINT TO MATCH; MADE OF PLASTIC,BMP COV FT;WO/WASHERS;14-6 MDXWO/PARK;PRIME;PLASTIC,COUVERT P-CHOCS AV S/LAVE-PHAR,S/CAPT. A/APPRET PLSTQ,EA,,True,False,False,False,False,False,False,False,8.4000,700.49,237.59,3,4/20/2024 3:01:00 AM,76,24,23,True,False
1544073096,263313,AC1000183C,,,773,1000,,http://mediacdn.lkqcorp.com/ecomm/773/AC1000183C.jpg?width=400,FRONT BUMPER COVER; WITHOUT HEAD LIGHT WASHER HOLES; WITHOUT PARK,ASSIST SENSOR HOLES; PRIMED/PAINT TO MATCH; MADE OF PLASTIC,BMP COV FT;WO/WASHERS;14-6 MDXWO/PARK;PRIME;PLASTIC,COUVERT P-CHOCS AV S/LAVE-PHAR,S/CAPT. A/APPRET PLSTQ,EA,,True,False,True,True,False,False,False,False,11.8000,711.03,280.63,8,4/20/2024 3:01:00 AM,76,24,23,True,False
1543905370,263313,AC1000183R,,,773R,1000,,http://mediacdn.lkqcorp.com/ecomm/773R/AC1000183R.jpg?width=400,RECONDITIONED FRONT BUMPER COVER; WITHOUT HEAD LIGHT WASHER HOLES;,WITHOUT PARK ASSIST SENSOR HOLES; PRIMED/PAINT TO MATCH; MADE OF,BMP COV FT;WO/WASHERS;14-6 MDXWO/PARK;PRIME;PLASTIC,COUVERT P-CHOCS AV S/LAVE-PHAR,S/CAPT. A/APPRET PLSTQ,EA,,True,True,False,False,False,False,False,False,8.4000,719.75,321.31,0,4/20/2024 3:01:00 AM,76,24,23,True,True
1544084524,263313,AC1000184,,,773,1000,,http://mediacdn.lkqcorp.com/ecomm/773/AC1000184.jpg?width=400,FRONT BUMPER COVER; WITHOUT HEAD LIGHT WASHER HOLES; WITH PARK ASSIST,SENSOR HOLES; PRIMED/PAINT TO MATCH; MADE OF PLASTIC,BMP COV FT;WO/WASHERS;14-6 MDXW/PARK;PRIME;PLASTIC,COUVERT P-CHOCS AV S/LAVE-PHAR,A/CAPT. A/APPRET PLSTQ,EA,,True,False,False,False,False,False,False,False,14.0000,718.04,221.09,4,4/20/2024 3:01:00 AM,76,23,23,True,False
1543909985,263313,AC1000184C,,,773,1000,,http://mediacdn.lkqcorp.com/ecomm/773/AC1000184C.jpg?width=400,FRONT BUMPER COVER; WITHOUT HEAD LIGHT WASHER HOLES; WITH PARK ASSIST,SENSOR HOLES; PRIMED/PAINT TO MATCH; MADE OF PLASTIC,BMP COV FT;WO/WASHERS;14-6 MDXW/PARK;PRIME;PLASTIC,COUVERT P-CHOCS AV S/LAVE-PHAR,A/CAPT. A/APPRET PLSTQ,EA,,True,False,True,True,False,False,False,False,14.0000,742.84,281.89,4,4/20/2024 3:01:00 AM,76,23,23,True,False
1543917970,263313,AC1000184OE,,,773,1000,,http://mediacdn.lkqcorp.com/ecomm/773/AC1000184OE.jpg?width=400,FRONT BUMPER COVER; WITHOUT HEAD LIGHT WASHER HOLES; WITH PARK ASSIST,SENSOR HOLES; PRIMED/PAINT TO MATCH; MADE OF PLASTIC,BMP COV FT;WO/WASHERS;14-6 MDXW/PARK;PRIME;PLASTIC,COUVERT P-CHOCS AV S/LAVE-PHAR,A/CAPT. A/APPRET PLSTQ,EA,,True,False,False,False,False,False,False,False,14.0000,753.07,557.23,4,4/20/2024 3:01:00 AM,76,23,23,True,False
1543882663,263313,AC1000184R,,,773R,1000,,http://mediacdn.lkqcorp.com/ecomm/773R/AC1000184R.jpg?width=400,RECONDITIONED FRONT BUMPER COVER; WITHOUT HEAD LIGHT WASHER HOLES;,WITH PARK ASSIST SENSOR HOLES; PRIMED/PAINT TO MATCH; MADE OF PLASTIC,BMP COV FT;WO/WASHERS;14-6 MDXW/PARK;PRIME;PLASTIC,COUVERT P-CHOCS AV S/LAVE-PHAR,A/CAPT. A/APPRET PLSTQ,EA,,True,True,False,False,False,False,False,False,14.0000,740.98,209.02,0,4/20/2024 3:01:00 AM,76,23,23,True,True
1544078344,263313,AC1000185,,,773,1000,,http://mediacdn.lkqcorp.com/ecomm/773/AC1000185.jpg?width=400,FRONT BUMPER COVER; WITHOUT PARK ASSIST SENSOR HOLES; WITHOUT HEAD,LIGHT WASHER HOLES; PRIMED/PAINT TO MATCH,BMP COV FT;WO/PARK;15-17 TLXWO/WASHERS;PRIME;PLASTIC,COUVERT P-CHOCS AV S/CAPT.,S/LAVE-PHARE A/APPRET PLSTQ,EA,,True,False,False,False,False,False,False,False,12.0000,402.81,189.11,1,4/20/2024 3:01:00 AM,75,27,20,True,False
1544076395,263313,AC1000185C,,,773,1000,,http://mediacdn.lkqcorp.com/ecomm/773/AC1000185C.jpg?width=400,FRONT BUMPER COVER; WITHOUT PARK ASSIST SENSOR HOLES; WITHOUT HEAD,LAMP WASHER HOLES; PRIMED/PAINT TO MATCH,BMP COV FT;WO/PARK;15-17 TLXWO/WASHERS;PRIME,COUVERT P-CHOCS AV S/CAPT.,S/LAVE-PHARE A/APPRET PLSTQ,EA,,True,False,True,True,False,False,False,False,12.0000,408.64,206.35,1,4/20/2024 3:01:00 AM,75,27,20,True,False
1543995189,263313,AC1000186,,,773,1000,,http://mediacdn.lkqcorp.com/ecomm/773/AC1000186.jpg?width=400,FRONT BUMPER COVER; WITH PARK ASSIST SENSOR HOLES; WITHOUT HEAD LIGHT,WASHER HOLES; PRIMED/PAINT TO MATCH; MADE OF PLASTIC,BMP COV FT;W/PARK;15-17 TLXWO/WASHERS;PRIME;PLASTIC,COUVERT P-CHOCS AV A/CAPT.,S/LAVE-PHARE A/APPRET PLSTQ,EA,,True,False,False,False,False,False,False,False,11.0000,403.39,199.13,1,4/20/2024 3:01:00 AM,73,27,21,True,False
1543986436,263313,AC1000189,,,773,1000,,http://mediacdn.lkqcorp.com/ecomm/773/AC1000189.jpg?width=400,FRONT BUMPER COVER; PRIMED/PAINT TO MATCH; MADE OF PLASTIC,,BMP COV FT;16-18 ILXPRIME;PLASTIC,COUVERT P-CHOCS AV,A/APPRET PLSTQ,EA,,True,False,False,False,False,False,False,False,9.0000,431.44,190.39,0,4/20/2024 3:01:00 AM,70,28,19,True,False
1543963235,263313,AC1000189C,,,773,1000,,http://mediacdn.lkqcorp.com/ecomm/773/AC1000189C.jpg?width=400,FRONT BUMPER COVER; PRIMED/PAINT TO MATCH; MADE OF PLASTIC,,BMP COV FT;16-18 ILXPRIME;PLASTIC,COUVERT P-CHOCS AV,A/APPRET PLSTQ,EA,,True,False,True,True,False,False,False,False,9.0000,437.92,210.93,0,4/20/2024 3:01:00 AM,70,28,19,True,False
1544071426,263313,AC1000190,,,773,1000,,http://mediacdn.lkqcorp.com/ecomm/773/AC1000190.jpg?width=400,FRONT BUMPER COVER; WITHOUT PARK ASSIST SENSOR HOLES; FOR BASE AND,TECHNOLOGY MODELS; PRIMED/PAINT TO MATCH; MADE OF PLASTIC,BMP COV FT;WO/PARK;16-18 RDXBASE/TECHNOLOGY;PRIME;PLASTIC,COUVERT P-CHOCS AV S/CAPT.,BASE/TECHNOLOGY A/APPRET PLSTQ,EA,,True,False,False,False,False,False,False,False,11.0000,406.05,193.16,0,4/20/2024 3:01:00 AM,76,26,24,True,False
1543951370,263313,AC1000190C,,,773,1000,,http://mediacdn.lkqcorp.com/ecomm/773/AC1000190C.jpg?width=400,FRONT BUMPER COVER; WITHOUT PARK ASSIST SENSOR HOLES; FOR BASE AND,TECHNOLOGY MODELS; PRIMED/PAINT TO MATCH; MADE OF PLASTIC,BMP COV FR;WO/PARK;16-18 RDXBASE/TECHNOLOGY;PRIME;PLASTIC,COUVERT P-CHOCS AV S/CAPT.,BASE/TECHONOLOGY A/APPRET PLTQ,EA,,True,False,True,True,False,False,False,False,11.0000,411.16,211.78,5,4/20/2024 3:01:00 AM,76,26,24,True,False
1543949402,263313,AC1000191,,,773,1000,,http://mediacdn.lkqcorp.com/ecomm/773/AC1000191.jpg?width=400,FRONT BUMPER COVER; WITH PARK ASSIST SENSOR HOLES; FOR ADVANCE AND,ELITE MODELS; PRIMED/PAINT TO MATCH; MADE OF PLASTIC,BMP COV FT;W/PARK;16-18 RDXADVANCE/ELITE;PRIME;PLASTIC,COUVERT P-CHOCS AV A/CAPT.,ADVANCE/ELITE A/APPRET PLSTQ,EA,,True,False,False,False,False,False,False,False,11.0000,410.01,195.83,0,4/20/2024 3:01:00 AM,76,26,24,True,False
1543996417,263313,AC1000192,,,773,1000,,http://mediacdn.lkqcorp.com/ecomm/773/AC1000192.jpg?width=400,FRONT BUMPER COVER; WITHOUT HEAD LIGHT WASHER HOLES; WITHOUT PARK,ASSIST SENSOR HOLES; FITS 2019-2020 TECHNOLOGY PACKAGE; PRIMED/PAINT,BMP COV FT;WO/WASHERS;17-8 MDXWO/PARK;19-20 TECH PKG;PRIME,COUVERT P-CHOCS AV S/LAVE-PHAR,S/CAPT 19-20 TECH PKG A/APP PP,EA,,True,False,False,False,False,False,False,False,9.0000,655.77,227.59,0,4/20/2024 3:01:00 AM,78,23,23,True,False
1543961009,263313,AC1000192C,,,773,1000,,http://mediacdn.lkqcorp.com/ecomm/773/AC1000192C.jpg?width=400,FRONT BUMPER COVER; WITHOUT HEAD LIGHT WASHER HOLES; WITHOUT PARK,ASSIST SENSOR HOLES; FITS 2019-2020 TECHNOLOGY PACKAGE;  PRIMED/PAINT,BMP COV FT;WO/WASHERS;17-8 MDXWO/PARK;19-20 TECH PKG;PRIME,COUVERT P-CHOCS AV S/LAVE-PHAR,S/CAPT 19-20 TECH PKG A/APP PP,EA,,True,False,True,True,False,False,False,False,9.0000,664.57,278.34,5,4/20/2024 3:01:00 AM,78,23,23,True,False
1544083371,263313,AC1000195,,,773,1000,,http://mediacdn.lkqcorp.com/ecomm/773/AC1000195.jpg?width=400,FRONT BUMPER COVER; WITHOUT A-SPEC; WITHOUT HEAD LIGHT WASHER HOLES;,WITHOUT PARK ASSIST SENSOR HOLES; PRIMED/PAINT TO MATCH; MADE OF,BMP COV FT;WO/A-SPEC;18-20 TLXWO/WASHERS;WO/PARK;PRIME;PP,COUVERT P-CHOCS AV S/A-SPEC,S/LAVE-PHARE S/CAPT A/APP PP,EA,,True,False,False,False,False,False,False,False,13.9000,389.13,171.70,5,4/20/2024 3:01:00 AM,72,24,21,True,False
1543895440,263313,AC1000195C,,,773,1000,,http://mediacdn.lkqcorp.com/ecomm/773/AC1000195C.jpg?width=400,FRONT BUMPER COVER; WITHOUT A-SPEC; WITHOUT HEAD LIGHT WASHER HOLES;,WITHOUT PARK ASSIST SENSOR HOLES; PRIMED/PAINT TO MATCH; MADE OF,BMP COV FT;WO/A-SPEC;18-20 TLXWO/WASHERS;WO/PARK;PRIME;PP,COUVERT P-CHOCS AV S/A-SPEC,S/LAVE-PHARE S/CAPT A/APP PP,EA,,True,False,True,True,False,False,False,False,11.0000,394.26,189.85,4,4/20/2024 3:01:00 AM,71,21,0,True,False